{"text_format":"1","workbook":"xlsx","n_sheets":2,"sheets":["卒業生各種証明書発行願","式"],"not_rendered":{"charts":0,"images":0,"macros":1,"external_links":0,"defined_names":1,"comments":0,"pivot_tables":0},"unopened":[],"bounds":{"document_bytes":16777216,"sheet_cells":100000,"rows_first":2000,"rows_last":500,"rows_between":2000,"halvings":0,"cell_chars":16384,"cell_head_chars":4096},"cells_cut":0,"cells_raw":0,"read":"whole","date_system":"1900"}

{"sheet":"卒業生各種証明書発行願","index":0,"n_rows":53,"n_cols":21,"rows_kept":53,"cut":false,"hidden":false,"merged":[[49,18,49,20],[50,18,50,20],[44,14,48,20],[49,1,49,17],[50,1,50,17],[30,14,30,20],[24,1,24,17],[25,1,25,17],[31,2,31,7],[48,2,48,7],[37,1,37,17],[38,1,38,17],[24,18,24,20],[25,18,25,20],[37,18,37,20],[38,18,38,20],[34,10,34,11],[34,12,34,13],[35,10,35,11],[35,12,35,13],[40,1,40,3],[32,2,32,7],[33,2,33,7],[35,2,35,7],[44,12,44,13],[45,10,45,11],[45,12,45,13],[46,10,46,11],[46,12,46,13],[47,10,47,11],[47,12,47,13],[48,10,48,11],[48,12,48,13],[52,1,52,3],[52,7,52,9],[52,10,52,12],[18,14,18,20],[27,15,27,17],[27,18,27,19],[27,10,27,12],[27,7,27,9],[30,2,30,7],[18,10,18,13],[19,12,19,13],[20,10,20,11],[20,12,20,13],[21,10,21,11],[21,12,21,13],[30,10,30,13],[22,12,22,13],[23,10,23,11],[23,12,23,13],[22,2,22,7],[19,14,23,20],[52,15,52,17],[52,18,52,19],[44,10,44,11],[5,10,5,12],[2,13,2,20],[12,1,12,20],[13,1,13,20],[3,1,3,2],[3,3,3,20],[33,12,33,13],[36,10,36,11],[36,12,36,13],[31,10,31,11],[31,12,31,13],[32,10,32,11],[32,12,32,13],[33,10,33,11],[9,1,9,20],[10,1,10,20],[22,10,22,11],[18,2,18,7],[27,1,27,3],[21,8,21,9],[22,8,22,9],[23,8,23,9],[20,8,20,9],[2,1,2,2],[4,1,4,2],[7,1,7,2],[5,1,5,2],[15,1,15,20],[5,3,5,4],[5,6,5,7],[2,3,2,8],[4,3,4,8],[6,3,6,8],[7,3,7,20],[14,1,14,20],[11,1,11,20],[2,10,2,12],[4,10,4,12],[6,10,6,12],[6,13,6,20],[0,0,0,21],[46,2,46,7],[47,2,47,7],[44,2,44,7],[45,2,45,7],[40,10,40,12],[40,7,40,9],[40,15,40,17],[40,18,40,19],[43,10,43,13],[43,14,43,20],[43,2,43,7],[23,2,23,7],[36,2,36,7],[34,2,34,7],[19,2,19,7],[20,2,20,7],[21,2,21,7],[31,14,36,20],[4,13,4,14],[5,13,5,14],[6,1,6,2],[18,8,18,9],[19,10,19,11]]}
["東京国際大学付属日本語学校 卒業生各種証明書発行願"]
[]
[null,"学籍番号",null,null,null,null,null,null,null,null,"国籍"]
[null,"英字氏名"]
[null,"漢字氏名",null,null,null,null,null,null,null,null,"生年月日",null,null,null,null,"年",null,"月",null,"日"]
[null,"入学年月",null,null,null,"年",null,null,"月",null,"卒業/退学年月",null,null,null,null,"年",null,"月"]
[null,"電話番号",null,null,null,null,null,null,null,null,"メールアドレス"]
[null,"送付先"]
[]
[null,"※学校教育校法施行規則第28条第2項の規定に基づき、卒業後5年以上経過している場合、資料の保存期間満了の"]
[null,"   ため、発行できないものもあります。"]
[null,"※氏名はパスポートに記載されている英字氏名と漢字氏名を記入してください。"]
[null,"※送付先は海外の場合、住所を英語表記記入してください。国内の場合、郵便番号を記入してください。"]
[null,"※申請書類を確認後、学校側から合計金額及び振込先を案内します。振込手数料及び、海外送金手数料は自己負担となります。"]
[null,"※作成日数：和文は入金確認後から4日後、英文は入金確認後から7日後に発送します。"]
[null,"※【各種証明書発行願】と【本人確認書類のコピー】と一緒に返送してください。"]
[]
[null,"◆2018年10月以降入学者　※下記2～5の証明書は和英併記です。"]
[null,"No","証明書の種類",null,null,null,null,null,"和文・英文",null,"手数料",null,null,null,"使用目的（提出先）"]
[null,1,"成績・出席証明書",null,null,null,null,null,null,null,500,null,"円 /１通"]
[null,2,"卒業証明書",null,null,null,null,null,null,null,500,null,"円 /１通"]
[null,3,"修了証明書（準備教育課程）",null,null,null,null,null,null,null,500,null,"円 /１通"]
[null,4,"在籍期間証明書",null,null,null,null,null,null,null,500,null,"円 /１通"]
[null,5,"退学証明書",null,null,null,null,null,null,null,500,null,"円 /１通"]
[null,"※必須　送料・受取方法（以下から選択してください）",null,null,null,null,null,null,null,null,null,null,null,null,null,null,null,null,"送　料"]
[null,"送料・受取方法を選んでください",null,null,null,null,null,null,null,null,null,null,null,null,null,null,null,null,{"$f":"IF(B26=\"\",\"\",VLOOKUP(B26,式!$A$2:$B$8,2,0))","v":{"$error":"#N/A"}}]
[]
[null,"合 計 枚 数",null,null,{"$f":"I20+J20+I21+I22+I23+I24","v":0},"枚",null,"証明書金額",null,null,{"$f":"E28*500","v":0},null,null,"円",null,"合計金額（送料込）",null,null,{"$f":"K28+S26","v":{"$error":"#N/A"}},null,"円"]
[]
[null,"◆2012年4月から2018年7月入学生"]
[null,"No","証明書の種類",null,null,null,null,null,"和文","英文","手数料",null,null,null,"使用目的（提出先）"]
[null,1,"出席証明書",null,null,null,null,null,null,null,500,null,"円 /１通"]
[null,2,"成績証明書",null,null,null,null,null,null,null,500,null,"円 /１通"]
[null,3,"卒業証明書",null,null,null,null,null,null,null,500,null,"円 /１通"]
[null,4,"修了証明書（準備教育課程）",null,null,null,null,null,null,null,500,null,"円 /１通"]
[null,5,"在籍期間証明書",null,null,null,null,null,null,null,500,null,"円 /１通"]
[null,6,"退学証明書",null,null,null,null,null,null,null,500,null,"円 /１通"]
[null,"※必須　送料・受取方法（以下から選択してください）",null,null,null,null,null,null,null,null,null,null,null,null,null,null,null,null,"送　料"]
[null,"送料・受取方法を選んでください",null,null,null,null,null,null,null,null,null,null,null,null,null,null,null,null,{"$f":"IF(B39=\"\",\"\",VLOOKUP(B39,式!$A$2:$B$8,2,0))","v":{"$error":"#N/A"}}]
[]
[null,"合 計 枚 数",null,null,{"$f":"I32+I33+I34+I35+I36+I37+J32+J33+J34+J35+J36+J37","v":0},"枚",null,"証明書金額",null,null,{"$f":"E41*500","v":0},null,null,"円",null,"合計金額（送料込）",null,null,{"$f":"K41+S39","v":{"$error":"#N/A"}},null,"円"]
[]
[null,"◆2012年4月以前入学者"]
[null,"No","証明書の種類",null,null,null,null,null,"和文","英文","手数料",null,null,null,"使用目的（提出先）"]
[null,1,"卒業証明書",null,null,null,null,null,null,null,500,null,"円 /１通"]
[null,2,"修了証明書（準備教育課程）",null,null,null,null,null,null,null,500,null,"円 /１通"]
[null,3,"在籍期間証明書",null,null,null,null,null,null,null,500,null,"円 /１通"]
[null,4,"退学証明書",null,null,null,null,null,null,null,500,null,"円 /１通"]
[null,5,"発行不可証明書",null,null,null,null,null,null,null,500,null,"円 /１通"]
[null,"※必須　送料・受取方法（以下から選択してください）",null,null,null,null,null,null,null,null,null,null,null,null,null,null,null,null,"送　料"]
[null,"送料・受取方法を選んでください",null,null,null,null,null,null,null,null,null,null,null,null,null,null,null,null,{"$f":"IF(B51=\"\",\"\",VLOOKUP(B51,式!$A$2:$B$8,2,0))","v":{"$error":"#N/A"}}]
[]
[null,"合 計 枚 数",null,null,{"$f":"I45+I46+I47+I48+I49+J45+J46+J47+J48+J49","v":0},"枚",null,"証明書金額",null,null,{"$f":"(I45+J45)*K45+(I46+J46+I47+J47+I48+J48+I49+J49)*K46","v":0},null,null,"円",null,"合計金額（送料込）",null,null,{"$f":"K53+S51","v":{"$error":"#N/A"}},null,"円"]

{"sheet":"式","index":1,"n_rows":8,"n_cols":2,"rows_kept":8,"cut":false,"hidden":true,"merged":[]}
["送料・受取方法を選んでください"]
["国内：窓口で受け取る",0]
["国内：レターパックライト",430]
["海外 EMS：第1地帯（アジア）台湾・中国（香港・マカオを除く）・韓国",1450]
["海外 EMS：第2地帯（アジア）（香港・マカオを含む）",1900]
["海外 EMS：第3地帯（オセアニア・カナダ・メキシコ・中近東・ヨーロッパ）",3150]
["海外 EMS：第4地帯（米国）グアム等海外領土含む",3900]
["海外 EMS：第5地帯（中南米「メキシコを除く」・アフリカ）",3600]